Trial Court Procedural Documents
type: Class
alternative label: 一审法院程序文件
subclass of: R7zvYKadqTXgMZV8ghLsloR
definition: Trial Court Procedural Documents are written materials that are filed with a court during the course of a trial, such as motions, pleadings, and orders, which outline the procedural steps taken by the parties involved in the case.