Greek, Modern
type: Class
alternative label: 现代希腊语
subclass of: RDOvAHsvY8TKJ1O1orXPM9o
definition: Greek, Modern (1453-) is a form of language that emerged after the fall of the Byzantine Empire and is still in use today.