Afar
type: Class
alternative label: 阿法尔语
subclass of: RDOvAHsvY8TKJ1O1orXPM9o
definition: Afar (Language) is a structured system of communication that consists of grammar and vocabulary, and is a member of the Language class.