Landlord Insurance Policy
type: Class
preferred label: Rental Property Insurance
subclass of: R75X7YZe3jw77Sogk8Vz8NT
definition: Landlord insurance is designed to provide coverage for property owners who rent out one or more residential homes, apartments, or condos. It generally covers the building structure, and it may also provide coverage for loss of rental income and liability protection. It typically does not cover the personal belongings of the tenants.