Joint Filing Agreement
type: Class
subclass of: RcW4pUMnXuufMtnyvdX0dB
definition: A Joint Filing Agreement is an agreement between parties that allows them to file certain documents jointly, especially with regulatory agencies. Often seen in securities law, it signifies that the filers have collaborated on the document but may not agree on all points or share the same views.