Visa for Intermittent Intra-Company Transferee
type: Class
alternative label: L-1A Visa
subclass of: RD1oQDMlC6FytjOndhJTMy8
definition: Visas for intermittent intra-company transferees (in the United States, L-1A Visa) is designed for managers, executives, or specialized knowledge employees who need to travel back and forth between affiliated companies in their home country and the destination country (e.g., U.S.). In the United States, the intermittent L-1 allows the individual to stay in the U.S. for shorter periods without affecting the maximum allowable period of stay, which is typically seven years for L-1A visas and five years for L-1B visas