Georgia Superior Court - Paulding County
type: Class
subclass of: RCBE5bLTCIia7wAstjMsnKO
definition: A court of general jurisdiction in the state of Georgia, located in Paulding County and presided over by a judge.