Visa for Foreign Government Employees on Official Business
type: Class
alternative label: A-2 Visa
subclass of: RDeH9slXtJOmFPiZhIzsDUg
definition: Visa for full-time foreign government employees who will conduct official business of the foreign country at an embassy, consulate, mission or military base.