Collision Auto Insurance Coverage Policy
type: Class
preferred label: Collision Coverage
subclass of: RCx52UAWgVQUnCDTQXlxMgU
definition: Collision auto insurance covers damage to the insured's own vehicle resulting from a collision with another vehicle or object, or from flipping over. It is generally an optional coverage but may be required if the vehicle is leased or financed. A deductible usually applies.