Indiana Superior Court - Vanderburgh County
type: Class
subclass of: R7uq2Mq8qLUybQoDhVczzZ5
definition: A court located in Vanderburgh County, Indiana that has jurisdiction over civil and criminal cases within its geographical area.