Borderline Personality Disorder
type: Class
alternative label: BPD
alternative label: Borderline Disorder
alternative label: EUPD
alternative label: Emotional Dysregulation Disorder
alternative label: Emotionally Unstable Personality Disorder
alternative label: Unstable Personality Disorder
subclass of: RCnCHWsREqpfQAAfaN2lRPV
definition: Borderline Personality Disorder (BPD) is a mental health condition characterized by pervasive instability in moods, behavior, self-image, and functioning. Individuals with BPD often experience intense episodes of anger, depression, and anxiety that can last from a few hours to days, leading to impulsive actions and unstable relationships.