Neonatology Malpractice
type: Class
alternative label: 新生儿医疗事故
subclass of: R8nVhrBlasGIc7jxw1D0vbm
definition: Negligent or wrongful conduct by a healthcare provider in the field of neonatology, resulting in harm or injury to a newborn or infant.