Religious Law
type: Class
preferred label: Ecclesiastical Law
subclass of: RSYBzf149Mi5KE0YtmpUmr
definition: Religious Law is a system of law based on religious texts and traditions, governing the conduct of adherents of a particular faith or belief.