L140 Document/File Management
type: Class
subclass of: RZisChrUg3JTZGhCXcya78
definition: The concept of L140 Document/File Management refers to the organization, storage, and retrieval of legal documents and files within a case, as a part of the overall case assessment, development, and administration process.