Trampoline Liability Claims
type: Class
alternative label: 蹦床责任索赔
subclass of: R7MsH9WtTPf14W1GB1m8zrB
definition: A claim made against a manufacturer or seller of trampolines for injuries or damages caused by a defect in the product.