Stipulation to Assume
type: Class
alternative label: 承担协议
subclass of: R8zxICG1ccCZO0nNV776P8B
definition: A Stipulation to Assume is a legal agreement between parties where one party agrees to take on the responsibility or liability for a particular matter or issue.