payee_name
type: Class
subclass of: R8ktJqdQifgzEaV2DJkdMZa
definition: The name of the payee for the expense item. If a payee name is indicated, the item is a disbursement paid to a third party and not a firm expense or soft cost.