Assignment by Buyer Clause
type: Class
alternative label: 买方转让条款
subclass of: RBBtDifX6Pckw5d02IiBWFF
definition: An Assignment by Buyer Clause is a provision in a contract that allows the buyer to transfer their rights and obligations to a third party.