Promise to Make a Will
type: Class
alternative label: 遗嘱承诺
subclass of: R3SDQBy4KfjSgp3bgpb4Fx
definition: A Promise to Make a Will is a legal concept within Trust and Estate Claims that refers to a commitment made by one party to another to create a will in the future.