Armenian
type: Class
alternative label: 亚美尼亚语
subclass of: RDOvAHsvY8TKJ1O1orXPM9o
definition: Armenian (Language) refers to the written or spoken structured system of communication that consists of grammar and vocabulary specific to the Armenian language.