Offset Clause
type: Class
alternative label: 抵消条款
subclass of: RDe0RKU39BlhcyACJW30ZLc
definition: An offset clause is a provision in a contract that requires one party to purchase goods or services from the other party in order to balance out payments owed.