New York City Court - Geneva
type: Class
subclass of: RCz0OhGJQscjwPvw2jQBP63
definition: New York City Court - Geneva is a specific court located in New York City that operates under the jurisdiction of the New York City Court.