Radiology Malpractice
type: Class
alternative label: 放射学医疗事故
subclass of: R8nVhrBlasGIc7jxw1D0vbm
definition: Radiology Malpractice refers to a type of medical malpractice claim that arises from errors or negligence in the interpretation of medical images or the performance of radiological procedures.