Ossetian; Ossetic
type: Class
alternative label: 奥塞梯语
subclass of: RDOvAHsvY8TKJ1O1orXPM9o
definition: A language spoken by the Ossetian people, primarily in the Caucasus region, which belongs to the Language top-level class in legal matters.