P100 Project Administration
type: Class
subclass of: Rn5kG4YdbRjOyGEVaUvrizw
definition: Focuses on administrative aspects of the assignment, including planning, budgeting, and maintenance of documents. Covers developing, negotiating, and revising the administrative plan and the budget for a matter. Also includes developing and communicating project status reports. Time coded here is to be distinguished from strategizing about the project, which is included in the P300 code.