Sound Recording
type: Class
preferred label: Audio Recording
alternative label: Recorded Audio
subclass of: RVaHiNBU68DENmeHicnzro
definition: A Sound Recording is a captured audio performance of sounds, whether musical, spoken, or otherwise, stored in a medium that can be played back, such as digital files, CDs, or vinyl records.