Consequential Damages Waiver Clause
type: Class
alternative label: 间接损害赔偿豁免条款
subclass of: RDe0RKU39BlhcyACJW30ZLc
definition: A Consequential Damages Waiver Clause is a provision in a contract that limits the liability of one party for indirect or consequential damages resulting from a breach of the contract.