Editor
type: Class
preferred label: Drafter
alternative label: 编辑
subclass of: R8eT1bTptg5J6ZfnwSUQYpf
subclass of: ROhQrThJyS0l40fB7FDDHU
definition: An Editor is a specific role in a document, responsible for reviewing and making changes to the content, as defined by the OASIS standard.