Northern Frisian
type: Class
alternative label: 北弗里西语
subclass of: RDOvAHsvY8TKJ1O1orXPM9o
definition: A language spoken in the northern region of the Frisian Islands, primarily in Germany, characterized by its unique grammar and vocabulary.