Trial Court Filing Event
type: Class
alternative label: 一审法院提交事件
subclass of: R73Uo5x4VyfiOXt6i4R256t
subclass of: RFLCbWnBgkHxPAEeVWloyg
subclass of: Rchny3YFXoQyenv6XUbyo0
definition: The Trial Court Filing Event refers to the act of submitting legal documents to initiate a lawsuit in a court of law.