DEPRECATED: M&A Target Industry - Favoring two tags: (1) Acquiree and (2) Industry from Mergers and Acquisitions
type: Class
subclass of: R8H8cpx25KBk3kH55YwSdDv
definition: A M&A Target Industry is a specific sector or area of business that a party aims to acquire or merge with as part of their overall Mergers and Acquisitions objectives.
source: ABA M&A Deal Points Study