Reimbursement of Expenses Clause
type: Class
alternative label: 费用报销条款
subclass of: RDe0RKU39BlhcyACJW30ZLc
definition: A Reimbursement of Expenses Clause is a provision in a contract that requires one party to compensate the other for any expenses incurred in the performance of the contract.