Successors and Assigns Clause
type: Class
alternative label: 继任者和受让人条款
subclass of: RDe0RKU39BlhcyACJW30ZLc
definition: A Successors and Assigns Clause is a provision in a contract that allows the rights and obligations of the parties to be transferred to another person or entity in the event of a merger, acquisition, or other change in ownership.