Lease Termination Agreement
type: Class
subclass of: R7I7inwWLqKi8ZMm0Ey6dkK
subclass of: RITVzcNUrw2Bg0fvFueOTT
subclass of: RxJhP6upqvHlawarYyeVQi
definition: A Lease Termination Agreement is a mutual agreement between the landlord and tenant to end the lease before its typical expiration date.