Burford Abstention
type: Class
alternative label: 伯福德回避原则
subclass of: RuliWeVDE8CQi4AATMNab1
definition: A legal doctrine known as Burford Abstention allows federal courts to decline jurisdiction over complex state regulatory schemes in order to avoid interfering with state administrative processes.