Motion to Substitute Counsel
type: Class
alternative label: 代理人替换动议
subclass of: R7z9q6EKXwifsayj0YR6x58
subclass of: R8zwKGkogGKIKWSVWb1ItRL
subclass of: R9Ii4OzSADsjS0VegX12oQJ
definition: A Motion to Substitute Counsel is a formal request made to a court by a party in a legal proceeding to replace their current attorney with a new one.