Business and Consumer Services Industry
type: Class
alternative label: 商业和消费者服务行业
subclass of: RDIwFaFcH4KY0gwEY0QlMTp
hidden label: BCS
definition: The Business Services industry group comprises establishments engaged in providing services not specifically provided for elsewhere in the classification system. Establishments in this sector are primarily engaged in activities such as equipment and machinery repairing, promoting or administering religious activities, grantmaking, advocacy, and providing drycleaning and laundry services, personal care services, death care services, pet care services, photofinishing services, temporary parking services, and dating services.