Indiana Superior Court - Newton County
type: Class
subclass of: R7uq2Mq8qLUybQoDhVczzZ5
definition: The Indiana Superior Court - Newton County is a specific court within the Indiana Superior Court system that has jurisdiction over cases within Newton County.