Matter Tax on Fees
type: Class
alternative label: 事项税费
subclass of: R18qjSeTEcA0ftKswAFKWG
subclass of: RMDZKh0zTn6FdXzpYpbsle
definition: A Matter Tax on Fees is a type of Tax Detail and Engagement Fee Detail that refers to a tax imposed on the fees charged for legal services provided in a specific matter or case.