Indiana Town Court - Marion County, Lawrence Twp.
type: Class
subclass of: RBB5cexM3974afJhhR2yXHA
definition: A court located in Marion County, Lawrence Township, Indiana that has limited jurisdiction over minor criminal offenses, traffic violations, and small claims cases.