Failure To Discharge a Mandatory Duty
type: Class
alternative label: 未履行强制性职责
subclass of: RBREngQZS9QIgeWCOMPBLIo
definition: The failure to fulfill a required obligation, which may result in legal liability, specifically within the context of government tort law.