Citation to Legislation
type: Class
alternative label: 引用法律
subclass of: R7fEpxSrDSl1VojeYSxppg
definition: A document's citations to bills and other legislation (e.g., bills before a legislature, bills before congress).