Parking Violation
type: Class
alternative label: 停车违规
subclass of: Rj1p7FbFSLxlWfUlSPZxhX
definition: A parking violation is a type of traffic violation claim that involves the improper or illegal parking of a vehicle, often resulting in a fine or penalty.