Prevailing Market Rate Clause
type: Class
alternative label: 盛行市场利率条款
subclass of: RDe0RKU39BlhcyACJW30ZLc
definition: A Prevailing Market Rate Clause is a provision in a contract that sets the price or rate for goods or services based on the current market conditions at the time of performance.