Gross Revenue
type: Class
alternative label: Gross Income
subclass of: RnfzkAKrjy32YoweXnzDjp
definition: The aggregate income generated from all forms of engagement before any costs, taxes, or deductions, offering a preliminary look at financial performance.