Deposition Posture
type: Class
alternative label: 沉积姿势
subclass of: RDrCoGiMIXR6TcVXppICUT5
definition: Deposition Posture refers to the specific role or position taken by a party during a deposition, such as observing, defending, or taking the deposition.