Oregon Circuit Court - Linn County
type: Class
subclass of: RmGrykg1NdiaxO77n1a1lc
definition: The Oregon Circuit Court - Linn County is a specific court within the Oregon Circuit Court system that has jurisdiction over legal matters within Linn County, Oregon.