No Delegation Clause
type: Class
alternative label: 无授权条款
subclass of: RDe0RKU39BlhcyACJW30ZLc
definition: A "No Delegation Clause" is a provision in a contract that prohibits one party from transferring their obligations or responsibilities to another party without the consent of the other party.