Assumption of Risk
type: Class
alternative label: 风险承担
subclass of: R7l492OzFfZUEluIFBwy3xI
subclass of: RBAoFbSK8WP6xJyVrgQd5PZ
subclass of: RCzs34uEQI9f4cuWp3bQO0P
definition: Assumption of Risk is a legal defense that asserts that the plaintiff voluntarily and knowingly assumed the risks associated with a particular activity or situation, and therefore cannot hold the defendant liable for any resulting harm or injury.