Partnership Agreement
type: Class
subclass of: RCNdhIWpodXkmuDPUE0YLKX
definition: A Partnership Agreement is a contract between partners in a partnership that specifies their mutual obligations, responsibilities, profit-sharing ratios, and other operational terms.